[Debian Stretch] Compile error after 100% Topic is solved

Please use template to report bugs and problems. Post here your questions when not sure where else to post
Only for bugs in the Domoticz application! other problems go in different subforums!
Forum rules
Before posting here, make sure you are on the latest Beta or Stable version.
If you have problems related to the web gui, clear your browser cache + appcache first.

Use the following template when posting here:

Version: xxxx
Platform: xxxx
Plugin/Hardware: xxxx
Description:
.....

If you are having problems with scripts/blockly, always post the script (in a spoiler or code tag) or screenshots of your blockly

If you are replying, please do not quote images/code from the first post

Please mark your topic as Solved when the problem is solved.
Post Reply
lmolenaar
Posts: 15
Joined: Friday 05 December 2014 14:08
Target OS: Linux
Domoticz version:
Location: Eindhoven
Contact:

[Debian Stretch] Compile error after 100%

Post by lmolenaar » Wednesday 21 June 2017 14:15

No idea why the compilation fails, please advise (clean compile from source)

- Linux nas 4.9.0-3-amd64 #1 SMP Debian 4.9.30-2 (2017-06-12) x86_64 GNU/Linux
- cmake version 3.8.2

Code: Select all

[ 98%] Building CXX object CMakeFiles/domoticz.dir/tinyxpath/xpath_stack.cpp.o
[ 99%] Building CXX object CMakeFiles/domoticz.dir/tinyxpath/xpath_static.cpp.o
[ 99%] Building CXX object CMakeFiles/domoticz.dir/tinyxpath/xpath_syntax.cpp.o
[100%] Linking CXX executable domoticz
CMakeFiles/domoticz.dir/hardware/OpenZWave.cpp.o: In function `COpenZWave::OnZWaveNotification(OpenZWave::Notification const*)':
OpenZWave.cpp:(.text+0xe94): undefined reference to `OpenZWave::Manager::GetNodeType[abi:cxx11](unsigned int, unsigned char)'
OpenZWave.cpp:(.text+0xf0c): undefined reference to `OpenZWave::Manager::GetNodeManufacturerId[abi:cxx11](unsigned int, unsigned char)'
OpenZWave.cpp:(.text+0xf5c): undefined reference to `OpenZWave::Manager::GetNodeManufacturerName[abi:cxx11](unsigned int, unsigned char)'
OpenZWave.cpp:(.text+0xfac): undefined reference to `OpenZWave::Manager::GetNodeProductType[abi:cxx11](unsigned int, unsigned char)'
OpenZWave.cpp:(.text+0xffc): undefined reference to `OpenZWave::Manager::GetNodeProductId[abi:cxx11](unsigned int, unsigned char)'
OpenZWave.cpp:(.text+0x104f): undefined reference to `OpenZWave::Manager::GetNodeProductName[abi:cxx11](unsigned int, unsigned char)'
OpenZWave.cpp:(.text+0x1452): undefined reference to `OpenZWave::Manager::GetNodeManufacturerId[abi:cxx11](unsigned int, unsigned char)'
OpenZWave.cpp:(.text+0x149f): undefined reference to `OpenZWave::Manager::GetNodeManufacturerName[abi:cxx11](unsigned int, unsigned char)'
OpenZWave.cpp:(.text+0x14ec): undefined reference to `OpenZWave::Manager::GetNodeProductType[abi:cxx11](unsigned int, unsigned char)'
OpenZWave.cpp:(.text+0x1539): undefined reference to `OpenZWave::Manager::GetNodeProductId[abi:cxx11](unsigned int, unsigned char)'
OpenZWave.cpp:(.text+0x229d): undefined reference to `OpenZWave::Manager::GetNodeProductName[abi:cxx11](unsigned int, unsigned char)'
OpenZWave.cpp:(.text+0x22e9): undefined reference to `OpenZWave::Manager::GetNodeManufacturerId[abi:cxx11](unsigned int, unsigned char)'
OpenZWave.cpp:(.text+0x2339): undefined reference to `OpenZWave::Manager::GetNodeManufacturerName[abi:cxx11](unsigned int, unsigned char)'
OpenZWave.cpp:(.text+0x2389): undefined reference to `OpenZWave::Manager::GetNodeProductType[abi:cxx11](unsigned int, unsigned char)'
OpenZWave.cpp:(.text+0x23d9): undefined reference to `OpenZWave::Manager::GetNodeProductId[abi:cxx11](unsigned int, unsigned char)'
OpenZWave.cpp:(.text+0x24f6): undefined reference to `OpenZWave::Notification::GetAsString[abi:cxx11]() const'
OpenZWave.cpp:(.text+0x258e): undefined reference to `OpenZWave::Notification::GetAsString[abi:cxx11]() const'
CMakeFiles/domoticz.dir/hardware/OpenZWave.cpp.o: In function `COpenZWave::EnableDisableDebug()':
OpenZWave.cpp:(.text+0x27fd): undefined reference to `OpenZWave::Options::AddOptionInt(std::__cxx11::basic_string<char, std::char_traits<char>, std::allocator<char> > const&, int)'
OpenZWave.cpp:(.text+0x2866): undefined reference to `OpenZWave::Options::AddOptionInt(std::__cxx11::basic_string<char, std::char_traits<char>, std::allocator<char> > const&, int)'
OpenZWave.cpp:(.text+0x28cf): undefined reference to `OpenZWave::Options::AddOptionInt(std::__cxx11::basic_string<char, std::char_traits<char>, std::allocator<char> > const&, int)'
OpenZWave.cpp:(.text+0x2937): undefined reference to `OpenZWave::Options::AddOptionInt(std::__cxx11::basic_string<char, std::char_traits<char>, std::allocator<char> > const&, int)'
OpenZWave.cpp:(.text+0x2991): undefined reference to `OpenZWave::Options::AddOptionInt(std::__cxx11::basic_string<char, std::char_traits<char>, std::allocator<char> > const&, int)'
CMakeFiles/domoticz.dir/hardware/OpenZWave.cpp.o:OpenZWave.cpp:(.text+0x29e8): more undefined references to `OpenZWave::Options::AddOptionInt(std::__cxx11::basic_string<char, std::char_traits<char>, std::allocator<char> > const&, int)' follow
CMakeFiles/domoticz.dir/hardware/OpenZWave.cpp.o: In function `COpenZWave::OpenSerialConnector()':
OpenZWave.cpp:(.text+0x2fb4): undefined reference to `OpenZWave::Options::Create(std::__cxx11::basic_string<char, std::char_traits<char>, std::allocator<char> > const&, std::__cxx11::basic_string<char, std::char_traits<char>, std::allocator<char> > const&, std::__cxx11::basic_string<char, std::char_traits<char>, std::allocator<char> > const&)'
OpenZWave.cpp:(.text+0x302c): undefined reference to `OpenZWave::Options::AddOptionInt(std::__cxx11::basic_string<char, std::char_traits<char>, std::allocator<char> > const&, int)'
OpenZWave.cpp:(.text+0x3095): undefined reference to `OpenZWave::Options::AddOptionBool(std::__cxx11::basic_string<char, std::char_traits<char>, std::allocator<char> > const&, bool)'
OpenZWave.cpp:(.text+0x30fe): undefined reference to `OpenZWave::Options::AddOptionBool(std::__cxx11::basic_string<char, std::char_traits<char>, std::allocator<char> > const&, bool)'
OpenZWave.cpp:(.text+0x3167): undefined reference to `OpenZWave::Options::AddOptionBool(std::__cxx11::basic_string<char, std::char_traits<char>, std::allocator<char> > const&, bool)'
OpenZWave.cpp:(.text+0x31d0): undefined reference to `OpenZWave::Options::AddOptionBool(std::__cxx11::basic_string<char, std::char_traits<char>, std::allocator<char> > const&, bool)'
OpenZWave.cpp:(.text+0x3417): undefined reference to `OpenZWave::Options::AddOptionString(std::__cxx11::basic_string<char, std::char_traits<char>, std::allocator<char> > const&, std::__cxx11::basic_string<char, std::char_traits<char>, std::allocator<char> > const&, bool)'
OpenZWave.cpp:(.text+0x3590): undefined reference to `OpenZWave::Manager::AddDriver(std::__cxx11::basic_string<char, std::char_traits<char>, std::allocator<char> > const&, OpenZWave::Driver::ControllerInterface const&)'
CMakeFiles/domoticz.dir/hardware/OpenZWave.cpp.o: In function `COpenZWave::GetValueByCommandClassLabel(int, int, int, std::__cxx11::basic_string<char, std::char_traits<char>, std::allocator<char> > const&, OpenZWave::ValueID&)':
OpenZWave.cpp:(.text+0x3d9a): undefined reference to `OpenZWave::Manager::GetValueLabel[abi:cxx11](OpenZWave::ValueID const&)'
CMakeFiles/domoticz.dir/hardware/OpenZWave.cpp.o: In function `COpenZWave::SwitchColor(int, int, int, std::__cxx11::basic_string<char, std::char_traits<char>, std::allocator<char> > const&)':
OpenZWave.cpp:(.text+0x4c46): undefined reference to `OpenZWave::Manager::SetValue(OpenZWave::ValueID const&, std::__cxx11::basic_string<char, std::char_traits<char>, std::allocator<char> > const&)'
CMakeFiles/domoticz.dir/hardware/OpenZWave.cpp.o: In function `COpenZWave::SetThermostatSetPoint(int, int, int, float)':
OpenZWave.cpp:(.text+0x4df2): undefined reference to `OpenZWave::Manager::GetValueUnits[abi:cxx11](OpenZWave::ValueID const&)'
CMakeFiles/domoticz.dir/hardware/OpenZWave.cpp.o: In function `COpenZWave::AddValue(OpenZWave::ValueID const&, COpenZWave::NodeInfo const*)':
OpenZWave.cpp:(.text+0x4ff0): undefined reference to `OpenZWave::Manager::GetValueLabel[abi:cxx11](OpenZWave::ValueID const&)'
OpenZWave.cpp:(.text+0x5071): undefined reference to `OpenZWave::Manager::GetValueAsString(OpenZWave::ValueID const&, std::__cxx11::basic_string<char, std::char_traits<char>, std::allocator<char> >*)'
OpenZWave.cpp:(.text+0x5174): undefined reference to `OpenZWave::Manager::GetValueUnits[abi:cxx11](OpenZWave::ValueID const&)'
OpenZWave.cpp:(.text+0x7338): undefined reference to `OpenZWave::Manager::GetValueListItems(OpenZWave::ValueID const&, std::vector<std::__cxx11::basic_string<char, std::char_traits<char>, std::allocator<char> >, std::allocator<std::__cxx11::basic_string<char, std::char_traits<char>, std::allocator<char> > > >*)'
OpenZWave.cpp:(.text+0x738b): undefined reference to `OpenZWave::Manager::GetValueListSelection(OpenZWave::ValueID const&, std::__cxx11::basic_string<char, std::char_traits<char>, std::allocator<char> >*)'
OpenZWave.cpp:(.text+0x74f1): undefined reference to `OpenZWave::Manager::GetValueListItems(OpenZWave::ValueID const&, std::vector<std::__cxx11::basic_string<char, std::char_traits<char>, std::allocator<char> >, std::allocator<std::__cxx11::basic_string<char, std::char_traits<char>, std::allocator<char> > > >*)'
OpenZWave.cpp:(.text+0x7544): undefined reference to `OpenZWave::Manager::GetValueListSelection(OpenZWave::ValueID const&, std::__cxx11::basic_string<char, std::char_traits<char>, std::allocator<char> >*)'
CMakeFiles/domoticz.dir/hardware/OpenZWave.cpp.o: In function `COpenZWave::UpdateNodeEvent(OpenZWave::ValueID const&, int)':
OpenZWave.cpp:(.text+0x8192): undefined reference to `OpenZWave::Manager::GetValueLabel[abi:cxx11](OpenZWave::ValueID const&)'
CMakeFiles/domoticz.dir/hardware/OpenZWave.cpp.o: In function `COpenZWave::UpdateNodeScene(OpenZWave::ValueID const&, int)':
OpenZWave.cpp:(.text+0x84c1): undefined reference to `OpenZWave::Manager::GetValueLabel[abi:cxx11](OpenZWave::ValueID const&)'
CMakeFiles/domoticz.dir/hardware/OpenZWave.cpp.o: In function `COpenZWave::UpdateValue(OpenZWave::ValueID const&)':
OpenZWave.cpp:(.text+0x8827): undefined reference to `OpenZWave::Manager::GetValueLabel[abi:cxx11](OpenZWave::ValueID const&)'
OpenZWave.cpp:(.text+0x884e): undefined reference to `OpenZWave::Manager::GetValueUnits[abi:cxx11](OpenZWave::ValueID const&)'
OpenZWave.cpp:(.text+0x89f9): undefined reference to `OpenZWave::Manager::GetValueAsString(OpenZWave::ValueID const&, std::__cxx11::basic_string<char, std::char_traits<char>, std::allocator<char> >*)'
OpenZWave.cpp:(.text+0x922f): undefined reference to `OpenZWave::Manager::GetValueAsString(OpenZWave::ValueID const&, std::__cxx11::basic_string<char, std::char_traits<char>, std::allocator<char> >*)'
OpenZWave.cpp:(.text+0x92a5): undefined reference to `OpenZWave::Manager::SetValue(OpenZWave::ValueID const&, std::__cxx11::basic_string<char, std::char_traits<char>, std::allocator<char> > const&)'
OpenZWave.cpp:(.text+0xac98): undefined reference to `OpenZWave::Manager::GetValueListItems(OpenZWave::ValueID const&, std::vector<std::__cxx11::basic_string<char, std::char_traits<char>, std::allocator<char> >, std::allocator<std::__cxx11::basic_string<char, std::char_traits<char>, std::allocator<char> > > >*)'
OpenZWave.cpp:(.text+0xacee): undefined reference to `OpenZWave::Manager::GetValueListSelection(OpenZWave::ValueID const&, std::__cxx11::basic_string<char, std::char_traits<char>, std::allocator<char> >*)'
OpenZWave.cpp:(.text+0xae1f): undefined reference to `OpenZWave::Manager::GetValueListItems(OpenZWave::ValueID const&, std::vector<std::__cxx11::basic_string<char, std::char_traits<char>, std::allocator<char> >, std::allocator<std::__cxx11::basic_string<char, std::char_traits<char>, std::allocator<char> > > >*)'
OpenZWave.cpp:(.text+0xae55): undefined reference to `OpenZWave::Manager::GetValueListSelection(OpenZWave::ValueID const&, std::__cxx11::basic_string<char, std::char_traits<char>, std::allocator<char> >*)'
CMakeFiles/domoticz.dir/hardware/OpenZWave.cpp.o: In function `COpenZWave::GetGroupName[abi:cxx11](int, int)':
OpenZWave.cpp:(.text+0xba2c): undefined reference to `OpenZWave::Manager::GetGroupLabel[abi:cxx11](unsigned int, unsigned char, unsigned char)'
CMakeFiles/domoticz.dir/hardware/OpenZWave.cpp.o: In function `COpenZWave::EnableNodePoll(unsigned int, int, int)':
OpenZWave.cpp:(.text+0xc810): undefined reference to `OpenZWave::Manager::GetValueLabel[abi:cxx11](OpenZWave::ValueID const&)'
CMakeFiles/domoticz.dir/hardware/OpenZWave.cpp.o: In function `COpenZWave::GetVersion[abi:cxx11]()':
OpenZWave.cpp:(.text+0xd5ee): undefined reference to `OpenZWave::Manager::getVersionAsString[abi:cxx11]()'
CMakeFiles/domoticz.dir/hardware/OpenZWave.cpp.o: In function `COpenZWave::GetVersionLong[abi:cxx11]()':
OpenZWave.cpp:(.text+0xd674): undefined reference to `OpenZWave::Manager::getVersionLongAsString[abi:cxx11]()'
CMakeFiles/domoticz.dir/hardware/OpenZWave.cpp.o: In function `COpenZWave::SetNodeName(unsigned int, int, std::__cxx11::basic_string<char, std::char_traits<char>, std::allocator<char> > const&)':
OpenZWave.cpp:(.text+0xd7f9): undefined reference to `OpenZWave::Manager::SetNodeName(unsigned int, unsigned char, std::__cxx11::basic_string<char, std::char_traits<char>, std::allocator<char> > const&)'
CMakeFiles/domoticz.dir/hardware/OpenZWave.cpp.o: In function `COpenZWave::SetClock(int, int, int, int, int, int)':
OpenZWave.cpp:(.text+0xdd43): undefined reference to `OpenZWave::Manager::SetValueListSelection(OpenZWave::ValueID const&, std::__cxx11::basic_string<char, std::char_traits<char>, std::allocator<char> > const&)'
CMakeFiles/domoticz.dir/hardware/OpenZWave.cpp.o: In function `COpenZWave::SetThermostatMode(int, int, int, int)':
OpenZWave.cpp:(.text+0xdf8a): undefined reference to `OpenZWave::Manager::SetValueListSelection(OpenZWave::ValueID const&, std::__cxx11::basic_string<char, std::char_traits<char>, std::allocator<char> > const&)'
CMakeFiles/domoticz.dir/hardware/OpenZWave.cpp.o: In function `COpenZWave::SetThermostatFanMode(int, int, int, int)':
OpenZWave.cpp:(.text+0xe07c): undefined reference to `OpenZWave::Manager::SetValueListSelection(OpenZWave::ValueID const&, std::__cxx11::basic_string<char, std::char_traits<char>, std::allocator<char> > const&)'
CMakeFiles/domoticz.dir/hardware/OpenZWave.cpp.o: In function `COpenZWave::GetNodeValuesJson(unsigned int, int, Json::Value&, int)':
OpenZWave.cpp:(.text+0xfe25): undefined reference to `OpenZWave::Manager::GetNodeManufacturerId[abi:cxx11](unsigned int, unsigned char)'
OpenZWave.cpp:(.text+0xfed9): undefined reference to `OpenZWave::Manager::GetNodeProductId[abi:cxx11](unsigned int, unsigned char)'
OpenZWave.cpp:(.text+0xff8d): undefined reference to `OpenZWave::Manager::GetNodeProductType[abi:cxx11](unsigned int, unsigned char)'
OpenZWave.cpp:(.text+0x10cbb): undefined reference to `OpenZWave::Manager::GetValueAsString(OpenZWave::ValueID const&, std::__cxx11::basic_string<char, std::char_traits<char>, std::allocator<char> >*)'
OpenZWave.cpp:(.text+0x10da5): undefined reference to `OpenZWave::Manager::GetValueListItems(OpenZWave::ValueID const&, std::vector<std::__cxx11::basic_string<char, std::char_traits<char>, std::allocator<char> >, std::allocator<std::__cxx11::basic_string<char, std::char_traits<char>, std::allocator<char> > > >*)'
OpenZWave.cpp:(.text+0x10ffb): undefined reference to `OpenZWave::Manager::GetValueLabel[abi:cxx11](OpenZWave::ValueID const&)'
OpenZWave.cpp:(.text+0x1102d): undefined reference to `OpenZWave::Manager::GetValueUnits[abi:cxx11](OpenZWave::ValueID const&)'
OpenZWave.cpp:(.text+0x1105f): undefined reference to `OpenZWave::Manager::GetValueHelp[abi:cxx11](OpenZWave::ValueID const&)'
OpenZWave.cpp:(.text+0x1144a): undefined reference to `OpenZWave::Manager::GetValueLabel[abi:cxx11](OpenZWave::ValueID const&)'
OpenZWave.cpp:(.text+0x114e2): undefined reference to `OpenZWave::Manager::GetValueAsString(OpenZWave::ValueID const&, std::__cxx11::basic_string<char, std::char_traits<char>, std::allocator<char> >*)'
OpenZWave.cpp:(.text+0x11666): undefined reference to `OpenZWave::Manager::GetValueLabel[abi:cxx11](OpenZWave::ValueID const&)'
OpenZWave.cpp:(.text+0x11698): undefined reference to `OpenZWave::Manager::GetValueUnits[abi:cxx11](OpenZWave::ValueID const&)'
OpenZWave.cpp:(.text+0x116ca): undefined reference to `OpenZWave::Manager::GetValueHelp[abi:cxx11](OpenZWave::ValueID const&)'
CMakeFiles/domoticz.dir/hardware/OpenZWave.cpp.o: In function `COpenZWave::ApplyNodeConfig(unsigned int, int, std::__cxx11::basic_string<char, std::char_traits<char>, std::allocator<char> > const&)':
OpenZWave.cpp:(.text+0x12b20): undefined reference to `OpenZWave::Manager::GetNodeManufacturerId[abi:cxx11](unsigned int, unsigned char)'
OpenZWave.cpp:(.text+0x12bd4): undefined reference to `OpenZWave::Manager::GetNodeProductId[abi:cxx11](unsigned int, unsigned char)'
OpenZWave.cpp:(.text+0x12c88): undefined reference to `OpenZWave::Manager::GetNodeProductType[abi:cxx11](unsigned int, unsigned char)'
OpenZWave.cpp:(.text+0x12f12): undefined reference to `OpenZWave::Manager::GetValueAsString(OpenZWave::ValueID const&, std::__cxx11::basic_string<char, std::char_traits<char>, std::allocator<char> >*)'
OpenZWave.cpp:(.text+0x12f6e): undefined reference to `OpenZWave::Manager::SetValueListSelection(OpenZWave::ValueID const&, std::__cxx11::basic_string<char, std::char_traits<char>, std::allocator<char> > const&)'
OpenZWave.cpp:(.text+0x12f97): undefined reference to `OpenZWave::Manager::SetValue(OpenZWave::ValueID const&, std::__cxx11::basic_string<char, std::char_traits<char>, std::allocator<char> > const&)'
CMakeFiles/domoticz.dir/hardware/OpenZWave.cpp.o: In function `COpenZWave::GetNodeUserCodes(unsigned int, int, Json::Value&)':
OpenZWave.cpp:(.text+0x135d8): undefined reference to `OpenZWave::Manager::GetValueAsString(OpenZWave::ValueID const&, std::__cxx11::basic_string<char, std::char_traits<char>, std::allocator<char> >*)'
CMakeFiles/domoticz.dir/hardware/OpenZWave.cpp.o: In function `COpenZWave::RemoveUserCode(unsigned int, int, int)':
OpenZWave.cpp:(.text+0x1396b): undefined reference to `OpenZWave::Manager::GetValueAsString(OpenZWave::ValueID const&, std::__cxx11::basic_string<char, std::char_traits<char>, std::allocator<char> >*)'
OpenZWave.cpp:(.text+0x13a25): undefined reference to `OpenZWave::Manager::SetValue(OpenZWave::ValueID const&, std::__cxx11::basic_string<char, std::char_traits<char>, std::allocator<char> > const&)'
CMakeFiles/domoticz.dir/hardware/openzwave/control_panel/ozwcp.cpp.o: In function `MyNode::newGroup(unsigned char)':
ozwcp.cpp:(.text+0x677): undefined reference to `OpenZWave::Manager::GetGroupLabel[abi:cxx11](unsigned int, unsigned char, unsigned char)'
CMakeFiles/domoticz.dir/hardware/openzwave/control_panel/ozwcp.cpp.o: In function `COpenZWaveControlPanel::web_get_values(int, TiXmlElement*)':
ozwcp.cpp:(.text+0x2927): undefined reference to `OpenZWave::Manager::GetValueLabel[abi:cxx11](OpenZWave::ValueID const&)'
ozwcp.cpp:(.text+0x297c): undefined reference to `OpenZWave::Manager::GetValueUnits[abi:cxx11](OpenZWave::ValueID const&)'
ozwcp.cpp:(.text+0x2a9e): undefined reference to `OpenZWave::Manager::GetValueListItems(OpenZWave::ValueID const&, std::vector<std::__cxx11::basic_string<char, std::char_traits<char>, std::allocator<char> >, std::allocator<std::__cxx11::basic_string<char, std::char_traits<char>, std::allocator<char> > > >*)'
ozwcp.cpp:(.text+0x2af2): undefined reference to `OpenZWave::Manager::GetValueListSelection(OpenZWave::ValueID const&, std::__cxx11::basic_string<char, std::char_traits<char>, std::allocator<char> >*)'
ozwcp.cpp:(.text+0x2c46): undefined reference to `OpenZWave::Manager::GetValueAsString(OpenZWave::ValueID const&, std::__cxx11::basic_string<char, std::char_traits<char>, std::allocator<char> >*)'
ozwcp.cpp:(.text+0x2d7f): undefined reference to `OpenZWave::Manager::GetValueHelp[abi:cxx11](OpenZWave::ValueID const&)'
CMakeFiles/domoticz.dir/hardware/openzwave/control_panel/ozwcp.cpp.o: In function `COpenZWaveControlPanel::SendPollResponse[abi:cxx11]()':
ozwcp.cpp:(.text+0x3719): undefined reference to `OpenZWave::Manager::GetNodePlusTypeString[abi:cxx11](unsigned int, unsigned char)'
ozwcp.cpp:(.text+0x3742): undefined reference to `OpenZWave::Manager::GetNodeRoleString[abi:cxx11](unsigned int, unsigned char)'
ozwcp.cpp:(.text+0x37e4): undefined reference to `OpenZWave::Manager::GetNodeDeviceTypeString[abi:cxx11](unsigned int, unsigned char)'
ozwcp.cpp:(.text+0x3894): undefined reference to `OpenZWave::Manager::GetNodeType[abi:cxx11](unsigned int, unsigned char)'
ozwcp.cpp:(.text+0x38f1): undefined reference to `OpenZWave::Manager::GetNodeName[abi:cxx11](unsigned int, unsigned char)'
ozwcp.cpp:(.text+0x394e): undefined reference to `OpenZWave::Manager::GetNodeLocation[abi:cxx11](unsigned int, unsigned char)'
ozwcp.cpp:(.text+0x39ab): undefined reference to `OpenZWave::Manager::GetNodeManufacturerName[abi:cxx11](unsigned int, unsigned char)'
ozwcp.cpp:(.text+0x3a08): undefined reference to `OpenZWave::Manager::GetNodeProductName[abi:cxx11](unsigned int, unsigned char)'
ozwcp.cpp:(.text+0x3c8e): undefined reference to `OpenZWave::Manager::GetNodeQueryStage[abi:cxx11](unsigned int, unsigned char)'
CMakeFiles/domoticz.dir/hardware/openzwave/control_panel/ozwcp.cpp.o: In function `COpenZWaveControlPanel::SetNodeValue(std::__cxx11::basic_string<char, std::char_traits<char>, std::allocator<char> > const&, std::__cxx11::basic_string<char, std::char_traits<char>, std::allocator<char> > const&)':
ozwcp.cpp:(.text+0x4456): undefined reference to `OpenZWave::Manager::SetValue(OpenZWave::ValueID const&, std::__cxx11::basic_string<char, std::char_traits<char>, std::allocator<char> > const&)'
CMakeFiles/domoticz.dir/hardware/openzwave/control_panel/ozwcp.cpp.o: In function `COpenZWaveControlPanel::DoSceneCommand(std::__cxx11::basic_string<char, std::char_traits<char>, std::allocator<char> > const&, std::__cxx11::basic_string<char, std::char_traits<char>, std::allocator<char> > const&, std::__cxx11::basic_string<char, std::char_traits<char>, std::allocator<char> > const&, std::__cxx11::basic_string<char, std::char_traits<char>, std::allocator<char> > const&)':
ozwcp.cpp:(.text+0x5978): undefined reference to `OpenZWave::Manager::SetSceneLabel(unsigned char, std::__cxx11::basic_string<char, std::char_traits<char>, std::allocator<char> > const&)'
ozwcp.cpp:(.text+0x5aab): undefined reference to `OpenZWave::Manager::AddSceneValue(unsigned char, OpenZWave::ValueID const&, std::__cxx11::basic_string<char, std::char_traits<char>, std::allocator<char> > const&)'
ozwcp.cpp:(.text+0x5b68): undefined reference to `OpenZWave::Manager::SetSceneValue(unsigned char, OpenZWave::ValueID const&, std::__cxx11::basic_string<char, std::char_traits<char>, std::allocator<char> > const&)'
ozwcp.cpp:(.text+0x5d8c): undefined reference to `OpenZWave::Manager::GetSceneLabel[abi:cxx11](unsigned char)'
ozwcp.cpp:(.text+0x6102): undefined reference to `OpenZWave::Manager::GetValueLabel[abi:cxx11](OpenZWave::ValueID const&)'
ozwcp.cpp:(.text+0x6165): undefined reference to `OpenZWave::Manager::GetValueUnits[abi:cxx11](OpenZWave::ValueID const&)'
ozwcp.cpp:(.text+0x61cb): undefined reference to `OpenZWave::Manager::SceneGetValueAsString(unsigned char, OpenZWave::ValueID const&, std::__cxx11::basic_string<char, std::char_traits<char>, std::allocator<char> >*)'
CMakeFiles/domoticz.dir/hardware/openzwave/control_panel/ozwcp.cpp.o: In function `COpenZWaveControlPanel::DoNodeChange(std::__cxx11::basic_string<char, std::char_traits<char>, std::allocator<char> > const&, int, std::__cxx11::basic_string<char, std::char_traits<char>, std::allocator<char> > const&)':
ozwcp.cpp:(.text+0x6692): undefined reference to `OpenZWave::Manager::SetNodeName(unsigned int, unsigned char, std::__cxx11::basic_string<char, std::char_traits<char>, std::allocator<char> > const&)'
ozwcp.cpp:(.text+0x6723): undefined reference to `OpenZWave::Manager::SetNodeLocation(unsigned int, unsigned char, std::__cxx11::basic_string<char, std::char_traits<char>, std::allocator<char> > const&)'
collect2: error: ld returned 1 exit status
CMakeFiles/domoticz.dir/build.make:5472: recipe for target 'domoticz' failed
make[2]: *** [domoticz] Error 1
CMakeFiles/Makefile2:103: recipe for target 'CMakeFiles/domoticz.dir/all' failed
make[1]: *** [CMakeFiles/domoticz.dir/all] Error 2
Makefile:151: recipe for target 'all' failed
make: *** [all] Error 2
CMakeCache

Code: Select all

# This is the CMakeCache file.
# For build in directory: /opt/domoticz-source
# It was generated by CMake: /usr/local/bin/cmake
# You can edit this file to change values found and used by cmake.
# If you do not want to change any of the values, simply exit the editor.
# If you do want to change a value, simply edit, save, and exit the editor.
# The syntax for the file is as follows:
# KEY:TYPE=VALUE
# KEY is the name of a variable in the cache.
# TYPE is a hint to GUIs for the type of VALUE, DO NOT EDIT TYPE!.
# VALUE is the current value for the KEY.

########################
# EXTERNAL cache entries
########################

//Boost atomic library (debug)
Boost_ATOMIC_LIBRARY_DEBUG:FILEPATH=/usr/lib/x86_64-linux-gnu/libboost_atomic.a

//Boost atomic library (release)
Boost_ATOMIC_LIBRARY_RELEASE:FILEPATH=/usr/lib/x86_64-linux-gnu/libboost_atomic.a

//Boost chrono library (debug)
Boost_CHRONO_LIBRARY_DEBUG:FILEPATH=/usr/lib/x86_64-linux-gnu/libboost_chrono.a

//Boost chrono library (release)
Boost_CHRONO_LIBRARY_RELEASE:FILEPATH=/usr/lib/x86_64-linux-gnu/libboost_chrono.a

//Boost date_time library (debug)
Boost_DATE_TIME_LIBRARY_DEBUG:FILEPATH=/usr/lib/x86_64-linux-gnu/libboost_date_time.a

//Boost date_time library (release)
Boost_DATE_TIME_LIBRARY_RELEASE:FILEPATH=/usr/lib/x86_64-linux-gnu/libboost_date_time.a

//The directory containing a CMake configuration file for Boost.
Boost_DIR:PATH=Boost_DIR-NOTFOUND

//Path to a file.
Boost_INCLUDE_DIR:PATH=/usr/include

//Boost library directory DEBUG
Boost_LIBRARY_DIR_DEBUG:PATH=/usr/lib/x86_64-linux-gnu

//Boost library directory RELEASE
Boost_LIBRARY_DIR_RELEASE:PATH=/usr/lib/x86_64-linux-gnu

//Boost system library (debug)
Boost_SYSTEM_LIBRARY_DEBUG:FILEPATH=/usr/lib/x86_64-linux-gnu/libboost_system.a

//Boost system library (release)
Boost_SYSTEM_LIBRARY_RELEASE:FILEPATH=/usr/lib/x86_64-linux-gnu/libboost_system.a

//Boost thread library (debug)
Boost_THREAD_LIBRARY_DEBUG:FILEPATH=/usr/lib/x86_64-linux-gnu/libboost_thread.a

//Boost thread library (release)
Boost_THREAD_LIBRARY_RELEASE:FILEPATH=/usr/lib/x86_64-linux-gnu/libboost_thread.a

//Path to a program.
CMAKE_AR:FILEPATH=/usr/bin/ar

//Choose the type of build, options are: None(CMAKE_CXX_FLAGS or
// CMAKE_C_FLAGS used) Debug Release RelWithDebInfo MinSizeRel.
CMAKE_BUILD_TYPE:STRING=

//Enable/Disable color output during build.
CMAKE_COLOR_MAKEFILE:BOOL=ON

//CXX compiler
CMAKE_CXX_COMPILER:FILEPATH=/usr/bin/c++

//Flags used by the compiler during all build types.
CMAKE_CXX_FLAGS:STRING=

//Flags used by the compiler during debug builds.
CMAKE_CXX_FLAGS_DEBUG:STRING=-g

//Flags used by the compiler during release builds for minimum
// size.
CMAKE_CXX_FLAGS_MINSIZEREL:STRING=-Os -DNDEBUG

//Flags used by the compiler during release builds.
CMAKE_CXX_FLAGS_RELEASE:STRING=-O3 -DNDEBUG

//Flags used by the compiler during release builds with debug info.
CMAKE_CXX_FLAGS_RELWITHDEBINFO:STRING=-O2 -g -DNDEBUG

//C compiler
CMAKE_C_COMPILER:FILEPATH=/usr/bin/cc

//Flags used by the compiler during all build types.
CMAKE_C_FLAGS:STRING=

//Flags used by the compiler during debug builds.
CMAKE_C_FLAGS_DEBUG:STRING=-g

//Flags used by the compiler during release builds for minimum
// size.
CMAKE_C_FLAGS_MINSIZEREL:STRING=-Os -DNDEBUG

//Flags used by the compiler during release builds.
CMAKE_C_FLAGS_RELEASE:STRING=-O3 -DNDEBUG

//Flags used by the compiler during release builds with debug info.
CMAKE_C_FLAGS_RELWITHDEBINFO:STRING=-O2 -g -DNDEBUG

//Flags used by the linker.
CMAKE_EXE_LINKER_FLAGS:STRING=

//Flags used by the linker during debug builds.
CMAKE_EXE_LINKER_FLAGS_DEBUG:STRING=

//Flags used by the linker during release minsize builds.
CMAKE_EXE_LINKER_FLAGS_MINSIZEREL:STRING=

//Flags used by the linker during release builds.
CMAKE_EXE_LINKER_FLAGS_RELEASE:STRING=

//Flags used by the linker during Release with Debug Info builds.
CMAKE_EXE_LINKER_FLAGS_RELWITHDEBINFO:STRING=

//Enable/Disable output of compile commands during generation.
CMAKE_EXPORT_COMPILE_COMMANDS:BOOL=OFF

//Install path prefix, prepended onto install directories.
CMAKE_INSTALL_PREFIX:PATH=/opt/domoticz

//Path to a program.
CMAKE_LINKER:FILEPATH=/usr/bin/ld

//Path to a program.
CMAKE_MAKE_PROGRAM:FILEPATH=/usr/bin/make

//Flags used by the linker during the creation of modules.
CMAKE_MODULE_LINKER_FLAGS:STRING=

//Flags used by the linker during debug builds.
CMAKE_MODULE_LINKER_FLAGS_DEBUG:STRING=

//Flags used by the linker during release minsize builds.
CMAKE_MODULE_LINKER_FLAGS_MINSIZEREL:STRING=

//Flags used by the linker during release builds.
CMAKE_MODULE_LINKER_FLAGS_RELEASE:STRING=

//Flags used by the linker during Release with Debug Info builds.
CMAKE_MODULE_LINKER_FLAGS_RELWITHDEBINFO:STRING=

//Path to a program.
CMAKE_NM:FILEPATH=/usr/bin/nm

//Path to a program.
CMAKE_OBJCOPY:FILEPATH=/usr/bin/objcopy

//Path to a program.
CMAKE_OBJDUMP:FILEPATH=/usr/bin/objdump

//Value Computed by CMake
CMAKE_PROJECT_NAME:STATIC=domoticz

//Path to a program.
CMAKE_RANLIB:FILEPATH=/usr/bin/ranlib

//Flags used by the linker during the creation of dll's.
CMAKE_SHARED_LINKER_FLAGS:STRING=

//Flags used by the linker during debug builds.
CMAKE_SHARED_LINKER_FLAGS_DEBUG:STRING=

//Flags used by the linker during release minsize builds.
CMAKE_SHARED_LINKER_FLAGS_MINSIZEREL:STRING=

//Flags used by the linker during release builds.
CMAKE_SHARED_LINKER_FLAGS_RELEASE:STRING=

//Flags used by the linker during Release with Debug Info builds.
CMAKE_SHARED_LINKER_FLAGS_RELWITHDEBINFO:STRING=

//If set, runtime paths are not added when installing shared libraries,
// but are added when building.
CMAKE_SKIP_INSTALL_RPATH:BOOL=NO

//If set, runtime paths are not added when using shared libraries.
CMAKE_SKIP_RPATH:BOOL=NO

//Flags used by the linker during the creation of static libraries.
CMAKE_STATIC_LINKER_FLAGS:STRING=

//Flags used by the linker during debug builds.
CMAKE_STATIC_LINKER_FLAGS_DEBUG:STRING=

//Flags used by the linker during release minsize builds.
CMAKE_STATIC_LINKER_FLAGS_MINSIZEREL:STRING=

//Flags used by the linker during release builds.
CMAKE_STATIC_LINKER_FLAGS_RELEASE:STRING=

//Flags used by the linker during Release with Debug Info builds.
CMAKE_STATIC_LINKER_FLAGS_RELWITHDEBINFO:STRING=

//Path to a program.
CMAKE_STRIP:FILEPATH=/usr/bin/strip

//If this value is on, makefiles will be generated without the
// .SILENT directive, and all commands will be echoed to the console
// during the make.  This is useful for debugging only. With Visual
// Studio IDE projects all commands are done without /nologo.
CMAKE_VERBOSE_MAKEFILE:BOOL=FALSE

//Enable to build RPM source packages
CPACK_SOURCE_RPM:BOOL=OFF

//Enable to build TBZ2 source packages
CPACK_SOURCE_TBZ2:BOOL=ON

//Enable to build TGZ source packages
CPACK_SOURCE_TGZ:BOOL=ON

//Enable to build TXZ source packages
CPACK_SOURCE_TXZ:BOOL=ON

//Enable to build TZ source packages
CPACK_SOURCE_TZ:BOOL=ON

//Enable to build ZIP source packages
CPACK_SOURCE_ZIP:BOOL=OFF

//Path to a file.
CURL_INCLUDE_DIR:PATH=/usr/include/x86_64-linux-gnu

//Path to a library.
CURL_LIBRARY:FILEPATH=/usr/lib/x86_64-linux-gnu/libcurl.so

//git command line client
GIT_EXECUTABLE:FILEPATH=/usr/bin/git

//Include I2C support
INCLUDE_LINUX_I2C:BOOL=ON

//Include SPI support
INCLUDE_SPI:BOOL=ON

//Path to a file.
LIBUSB_INCLUDE_DIR:PATH=/usr/include

//Path to a library.
LIBUSB_LIBRARY:FILEPATH=/usr/lib/x86_64-linux-gnu/libusb.so

//Value Computed by CMake
LUA_BINARY_DIR:STATIC=/opt/domoticz-source/lua

//Value Computed by CMake
LUA_SOURCE_DIR:STATIC=/opt/domoticz-source/lua

//Value Computed by CMake
MQTT_BINARY_DIR:STATIC=/opt/domoticz-source/MQTT

//Value Computed by CMake
MQTT_SOURCE_DIR:STATIC=/opt/domoticz-source/MQTT

//Path to a library.
OPENSSL_CRYPTO_LIBRARY:FILEPATH=/usr/lib/x86_64-linux-gnu/libcrypto.so

//Path to a file.
OPENSSL_INCLUDE_DIR:PATH=/usr/include

//Path to a library.
OPENSSL_SSL_LIBRARY:FILEPATH=/usr/lib/x86_64-linux-gnu/libssl.so

//Path to a library.
OpenZWave:FILEPATH=/opt/open-zwave-read-only/libopenzwave.a

//pkg-config executable
PKG_CONFIG_EXECUTABLE:FILEPATH=/usr/bin/pkg-config

//Path to a file.
PYTHON_INCLUDE_DIR:PATH=/usr/include/python3.5m

//Path to a library.
PYTHON_LIBRARY:FILEPATH=/usr/lib/x86_64-linux-gnu/libpython3.5m.so

//Path to a library.
PYTHON_LIBRARY_DEBUG:FILEPATH=PYTHON_LIBRARY_DEBUG-NOTFOUND

//Value Computed by CMake
SQLite_BINARY_DIR:STATIC=/opt/domoticz-source/sqlite

//Value Computed by CMake
SQLite_SOURCE_DIR:STATIC=/opt/domoticz-source/sqlite

//Path to a file.
TELLDUSCORE_INCLUDE:PATH=TELLDUSCORE_INCLUDE-NOTFOUND

//Path to a library.
UDEV:FILEPATH=/lib/x86_64-linux-gnu/libudev.so

//Use builtin lua library
USE_BUILTIN_LUA:BOOL=ON

//Use builtin Mosquitto library
USE_BUILTIN_MQTT:BOOL=ON

//Use builtin sqlite library
USE_BUILTIN_SQLITE:BOOL=ON

//Use builtin zlib library
USE_BUILTIN_ZLIB:BOOL=OFF

//Use Python for Plugins and Event-Scripts
USE_PYTHON:BOOL=ON

//Build with static BOOST libraries
USE_STATIC_BOOST:BOOL=ON

//Build with static libgcc/libstdc++ libraries
USE_STATIC_LIBSTDCXX:BOOL=ON

//Build with static OpenZwave libraries
USE_STATIC_OPENZWAVE:BOOL=ON

//Path to a file.
ZLIB_INCLUDE_DIR:PATH=/usr/include

//Path to a library.
ZLIB_LIBRARY_DEBUG:FILEPATH=ZLIB_LIBRARY_DEBUG-NOTFOUND

//Path to a library.
ZLIB_LIBRARY_RELEASE:FILEPATH=/usr/lib/x86_64-linux-gnu/libz.so

//Value Computed by CMake
domoticz_BINARY_DIR:STATIC=/opt/domoticz-source

//Value Computed by CMake
domoticz_SOURCE_DIR:STATIC=/opt/domoticz-source

//Dependencies for target
lua_LIB_DEPENDS:STATIC=

//Dependencies for target
mqtt_LIB_DEPENDS:STATIC=

//Dependencies for target
sqlite_LIB_DEPENDS:STATIC=


########################
# INTERNAL cache entries
########################

//Result of TEST_BIG_ENDIAN
BIGENDIAN:INTERNAL=0
//ADVANCED property for variable: Boost_ATOMIC_LIBRARY_DEBUG
Boost_ATOMIC_LIBRARY_DEBUG-ADVANCED:INTERNAL=1
//ADVANCED property for variable: Boost_ATOMIC_LIBRARY_RELEASE
Boost_ATOMIC_LIBRARY_RELEASE-ADVANCED:INTERNAL=1
//ADVANCED property for variable: Boost_CHRONO_LIBRARY_DEBUG
Boost_CHRONO_LIBRARY_DEBUG-ADVANCED:INTERNAL=1
//ADVANCED property for variable: Boost_CHRONO_LIBRARY_RELEASE
Boost_CHRONO_LIBRARY_RELEASE-ADVANCED:INTERNAL=1
//ADVANCED property for variable: Boost_DATE_TIME_LIBRARY_DEBUG
Boost_DATE_TIME_LIBRARY_DEBUG-ADVANCED:INTERNAL=1
//ADVANCED property for variable: Boost_DATE_TIME_LIBRARY_RELEASE
Boost_DATE_TIME_LIBRARY_RELEASE-ADVANCED:INTERNAL=1
//ADVANCED property for variable: Boost_DIR
Boost_DIR-ADVANCED:INTERNAL=1
//ADVANCED property for variable: Boost_INCLUDE_DIR
Boost_INCLUDE_DIR-ADVANCED:INTERNAL=1
//ADVANCED property for variable: Boost_LIBRARY_DIR_DEBUG
Boost_LIBRARY_DIR_DEBUG-ADVANCED:INTERNAL=1
//ADVANCED property for variable: Boost_LIBRARY_DIR_RELEASE
Boost_LIBRARY_DIR_RELEASE-ADVANCED:INTERNAL=1
//ADVANCED property for variable: Boost_SYSTEM_LIBRARY_DEBUG
Boost_SYSTEM_LIBRARY_DEBUG-ADVANCED:INTERNAL=1
//ADVANCED property for variable: Boost_SYSTEM_LIBRARY_RELEASE
Boost_SYSTEM_LIBRARY_RELEASE-ADVANCED:INTERNAL=1
//ADVANCED property for variable: Boost_THREAD_LIBRARY_DEBUG
Boost_THREAD_LIBRARY_DEBUG-ADVANCED:INTERNAL=1
//ADVANCED property for variable: Boost_THREAD_LIBRARY_RELEASE
Boost_THREAD_LIBRARY_RELEASE-ADVANCED:INTERNAL=1
//ADVANCED property for variable: CMAKE_AR
CMAKE_AR-ADVANCED:INTERNAL=1
//This is the directory where this CMakeCache.txt was created
CMAKE_CACHEFILE_DIR:INTERNAL=/opt/domoticz-source
//Major version of cmake used to create the current loaded cache
CMAKE_CACHE_MAJOR_VERSION:INTERNAL=3
//Minor version of cmake used to create the current loaded cache
CMAKE_CACHE_MINOR_VERSION:INTERNAL=8
//Patch version of cmake used to create the current loaded cache
CMAKE_CACHE_PATCH_VERSION:INTERNAL=2
//ADVANCED property for variable: CMAKE_COLOR_MAKEFILE
CMAKE_COLOR_MAKEFILE-ADVANCED:INTERNAL=1
//Path to CMake executable.
CMAKE_COMMAND:INTERNAL=/usr/local/bin/cmake
//Path to cpack program executable.
CMAKE_CPACK_COMMAND:INTERNAL=/usr/local/bin/cpack
//Path to ctest program executable.
CMAKE_CTEST_COMMAND:INTERNAL=/usr/local/bin/ctest
//ADVANCED property for variable: CMAKE_CXX_COMPILER
CMAKE_CXX_COMPILER-ADVANCED:INTERNAL=1
//ADVANCED property for variable: CMAKE_CXX_FLAGS
CMAKE_CXX_FLAGS-ADVANCED:INTERNAL=1
//ADVANCED property for variable: CMAKE_CXX_FLAGS_DEBUG
CMAKE_CXX_FLAGS_DEBUG-ADVANCED:INTERNAL=1
//ADVANCED property for variable: CMAKE_CXX_FLAGS_MINSIZEREL
CMAKE_CXX_FLAGS_MINSIZEREL-ADVANCED:INTERNAL=1
//ADVANCED property for variable: CMAKE_CXX_FLAGS_RELEASE
CMAKE_CXX_FLAGS_RELEASE-ADVANCED:INTERNAL=1
//ADVANCED property for variable: CMAKE_CXX_FLAGS_RELWITHDEBINFO
CMAKE_CXX_FLAGS_RELWITHDEBINFO-ADVANCED:INTERNAL=1
//ADVANCED property for variable: CMAKE_C_COMPILER
CMAKE_C_COMPILER-ADVANCED:INTERNAL=1
//ADVANCED property for variable: CMAKE_C_FLAGS
CMAKE_C_FLAGS-ADVANCED:INTERNAL=1
//ADVANCED property for variable: CMAKE_C_FLAGS_DEBUG
CMAKE_C_FLAGS_DEBUG-ADVANCED:INTERNAL=1
//ADVANCED property for variable: CMAKE_C_FLAGS_MINSIZEREL
CMAKE_C_FLAGS_MINSIZEREL-ADVANCED:INTERNAL=1
//ADVANCED property for variable: CMAKE_C_FLAGS_RELEASE
CMAKE_C_FLAGS_RELEASE-ADVANCED:INTERNAL=1
//ADVANCED property for variable: CMAKE_C_FLAGS_RELWITHDEBINFO
CMAKE_C_FLAGS_RELWITHDEBINFO-ADVANCED:INTERNAL=1
//Path to cache edit program executable.
CMAKE_EDIT_COMMAND:INTERNAL=/usr/local/bin/ccmake
//Executable file format
CMAKE_EXECUTABLE_FORMAT:INTERNAL=ELF
//ADVANCED property for variable: CMAKE_EXE_LINKER_FLAGS
CMAKE_EXE_LINKER_FLAGS-ADVANCED:INTERNAL=1
//ADVANCED property for variable: CMAKE_EXE_LINKER_FLAGS_DEBUG
CMAKE_EXE_LINKER_FLAGS_DEBUG-ADVANCED:INTERNAL=1
//ADVANCED property for variable: CMAKE_EXE_LINKER_FLAGS_MINSIZEREL
CMAKE_EXE_LINKER_FLAGS_MINSIZEREL-ADVANCED:INTERNAL=1
//ADVANCED property for variable: CMAKE_EXE_LINKER_FLAGS_RELEASE
CMAKE_EXE_LINKER_FLAGS_RELEASE-ADVANCED:INTERNAL=1
//ADVANCED property for variable: CMAKE_EXE_LINKER_FLAGS_RELWITHDEBINFO
CMAKE_EXE_LINKER_FLAGS_RELWITHDEBINFO-ADVANCED:INTERNAL=1
//ADVANCED property for variable: CMAKE_EXPORT_COMPILE_COMMANDS
CMAKE_EXPORT_COMPILE_COMMANDS-ADVANCED:INTERNAL=1
//Name of external makefile project generator.
CMAKE_EXTRA_GENERATOR:INTERNAL=
//Name of generator.
CMAKE_GENERATOR:INTERNAL=Unix Makefiles
//Name of generator platform.
CMAKE_GENERATOR_PLATFORM:INTERNAL=
//Name of generator toolset.
CMAKE_GENERATOR_TOOLSET:INTERNAL=
//Have symbol pthread_create
CMAKE_HAVE_LIBC_CREATE:INTERNAL=
//Have library pthreads
CMAKE_HAVE_PTHREADS_CREATE:INTERNAL=
//Have library pthread
CMAKE_HAVE_PTHREAD_CREATE:INTERNAL=1
//Have include pthread.h
CMAKE_HAVE_PTHREAD_H:INTERNAL=1
//Source directory with the top level CMakeLists.txt file for this
// project
CMAKE_HOME_DIRECTORY:INTERNAL=/opt/domoticz-source
//Install .so files without execute permission.
CMAKE_INSTALL_SO_NO_EXE:INTERNAL=1
//ADVANCED property for variable: CMAKE_LINKER
CMAKE_LINKER-ADVANCED:INTERNAL=1
//ADVANCED property for variable: CMAKE_MAKE_PROGRAM
CMAKE_MAKE_PROGRAM-ADVANCED:INTERNAL=1
//ADVANCED property for variable: CMAKE_MODULE_LINKER_FLAGS
CMAKE_MODULE_LINKER_FLAGS-ADVANCED:INTERNAL=1
//ADVANCED property for variable: CMAKE_MODULE_LINKER_FLAGS_DEBUG
CMAKE_MODULE_LINKER_FLAGS_DEBUG-ADVANCED:INTERNAL=1
//ADVANCED property for variable: CMAKE_MODULE_LINKER_FLAGS_MINSIZEREL
CMAKE_MODULE_LINKER_FLAGS_MINSIZEREL-ADVANCED:INTERNAL=1
//ADVANCED property for variable: CMAKE_MODULE_LINKER_FLAGS_RELEASE
CMAKE_MODULE_LINKER_FLAGS_RELEASE-ADVANCED:INTERNAL=1
//ADVANCED property for variable: CMAKE_MODULE_LINKER_FLAGS_RELWITHDEBINFO
CMAKE_MODULE_LINKER_FLAGS_RELWITHDEBINFO-ADVANCED:INTERNAL=1
//ADVANCED property for variable: CMAKE_NM
CMAKE_NM-ADVANCED:INTERNAL=1
//number of local generators
CMAKE_NUMBER_OF_MAKEFILES:INTERNAL=5
//ADVANCED property for variable: CMAKE_OBJCOPY
CMAKE_OBJCOPY-ADVANCED:INTERNAL=1
//ADVANCED property for variable: CMAKE_OBJDUMP
CMAKE_OBJDUMP-ADVANCED:INTERNAL=1
//Platform information initialized
CMAKE_PLATFORM_INFO_INITIALIZED:INTERNAL=1
//ADVANCED property for variable: CMAKE_RANLIB
CMAKE_RANLIB-ADVANCED:INTERNAL=1
//Path to CMake installation.
CMAKE_ROOT:INTERNAL=/usr/local/share/cmake-3.8
//ADVANCED property for variable: CMAKE_SHARED_LINKER_FLAGS
CMAKE_SHARED_LINKER_FLAGS-ADVANCED:INTERNAL=1
//ADVANCED property for variable: CMAKE_SHARED_LINKER_FLAGS_DEBUG
CMAKE_SHARED_LINKER_FLAGS_DEBUG-ADVANCED:INTERNAL=1
//ADVANCED property for variable: CMAKE_SHARED_LINKER_FLAGS_MINSIZEREL
CMAKE_SHARED_LINKER_FLAGS_MINSIZEREL-ADVANCED:INTERNAL=1
//ADVANCED property for variable: CMAKE_SHARED_LINKER_FLAGS_RELEASE
CMAKE_SHARED_LINKER_FLAGS_RELEASE-ADVANCED:INTERNAL=1
//ADVANCED property for variable: CMAKE_SHARED_LINKER_FLAGS_RELWITHDEBINFO
CMAKE_SHARED_LINKER_FLAGS_RELWITHDEBINFO-ADVANCED:INTERNAL=1
//CHECK_TYPE_SIZE: sizeof(unsigned short)
CMAKE_SIZEOF_UNSIGNED_SHORT:INTERNAL=2
//ADVANCED property for variable: CMAKE_SKIP_INSTALL_RPATH
CMAKE_SKIP_INSTALL_RPATH-ADVANCED:INTERNAL=1
//ADVANCED property for variable: CMAKE_SKIP_RPATH
CMAKE_SKIP_RPATH-ADVANCED:INTERNAL=1
//ADVANCED property for variable: CMAKE_STATIC_LINKER_FLAGS
CMAKE_STATIC_LINKER_FLAGS-ADVANCED:INTERNAL=1
//ADVANCED property for variable: CMAKE_STATIC_LINKER_FLAGS_DEBUG
CMAKE_STATIC_LINKER_FLAGS_DEBUG-ADVANCED:INTERNAL=1
//ADVANCED property for variable: CMAKE_STATIC_LINKER_FLAGS_MINSIZEREL
CMAKE_STATIC_LINKER_FLAGS_MINSIZEREL-ADVANCED:INTERNAL=1
//ADVANCED property for variable: CMAKE_STATIC_LINKER_FLAGS_RELEASE
CMAKE_STATIC_LINKER_FLAGS_RELEASE-ADVANCED:INTERNAL=1
//ADVANCED property for variable: CMAKE_STATIC_LINKER_FLAGS_RELWITHDEBINFO
CMAKE_STATIC_LINKER_FLAGS_RELWITHDEBINFO-ADVANCED:INTERNAL=1
//ADVANCED property for variable: CMAKE_STRIP
CMAKE_STRIP-ADVANCED:INTERNAL=1
//uname command
CMAKE_UNAME:INTERNAL=/bin/uname
//ADVANCED property for variable: CMAKE_VERBOSE_MAKEFILE
CMAKE_VERBOSE_MAKEFILE-ADVANCED:INTERNAL=1
//ADVANCED property for variable: CPACK_SOURCE_RPM
CPACK_SOURCE_RPM-ADVANCED:INTERNAL=1
//ADVANCED property for variable: CPACK_SOURCE_TBZ2
CPACK_SOURCE_TBZ2-ADVANCED:INTERNAL=1
//ADVANCED property for variable: CPACK_SOURCE_TGZ
CPACK_SOURCE_TGZ-ADVANCED:INTERNAL=1
//ADVANCED property for variable: CPACK_SOURCE_TXZ
CPACK_SOURCE_TXZ-ADVANCED:INTERNAL=1
//ADVANCED property for variable: CPACK_SOURCE_TZ
CPACK_SOURCE_TZ-ADVANCED:INTERNAL=1
//ADVANCED property for variable: CPACK_SOURCE_ZIP
CPACK_SOURCE_ZIP-ADVANCED:INTERNAL=1
//ADVANCED property for variable: CURL_INCLUDE_DIR
CURL_INCLUDE_DIR-ADVANCED:INTERNAL=1
//ADVANCED property for variable: CURL_LIBRARY
CURL_LIBRARY-ADVANCED:INTERNAL=1
//Where to put the executables for Domoticz
EXECUTABLE_OUTPUT_PATH:INTERNAL=
//Details about finding CURL
FIND_PACKAGE_MESSAGE_DETAILS_CURL:INTERNAL=[/usr/lib/x86_64-linux-gnu/libcurl.so][/usr/include/x86_64-linux-gnu][v7.52.1()]
//Details about finding LIBUSB
FIND_PACKAGE_MESSAGE_DETAILS_LIBUSB:INTERNAL=[/usr/lib/x86_64-linux-gnu/libusb.so][/usr/include][v()]
//Details about finding OpenSSL
FIND_PACKAGE_MESSAGE_DETAILS_OpenSSL:INTERNAL=[/usr/lib/x86_64-linux-gnu/libcrypto.so][/usr/include][v1.1.0f()]
//Details about finding PythonLibs
FIND_PACKAGE_MESSAGE_DETAILS_PythonLibs:INTERNAL=[/usr/lib/x86_64-linux-gnu/libpython3.5m.so][/usr/include/python3.5m][v3.5.3(3.4)]
//Details about finding Threads
FIND_PACKAGE_MESSAGE_DETAILS_Threads:INTERNAL=[TRUE][v()]
//Details about finding ZLIB
FIND_PACKAGE_MESSAGE_DETAILS_ZLIB:INTERNAL=[/usr/lib/x86_64-linux-gnu/libz.so][/usr/include][v1.2.8()]
//Result of TRY_COMPILE
HAVE_BIGENDIAN:INTERNAL=TRUE
//Result of TRY_COMPILE
HAVE_CMAKE_SIZEOF_UNSIGNED_SHORT:INTERNAL=TRUE
//Have include execinfo.h
HAVE_EXECINFO_H:INTERNAL=1
//Have include sys/types.h;linux/i2c-dev.h;linux/i2c.h
HAVE_LINUX_I2C_H:INTERNAL=1
//Have include sys/types.h;linux/spi/spidev.h
HAVE_LINUX_SPI_H:INTERNAL=1
//Have include stddef.h
HAVE_STDDEF_H:INTERNAL=1
//Have include stdint.h
HAVE_STDINT_H:INTERNAL=1
//Have include sys/types.h
HAVE_SYS_TYPES_H:INTERNAL=1
//Where to put the libraries for SQLite
LIBRARY_OUTPUT_PATH:INTERNAL=
//ADVANCED property for variable: OPENSSL_CRYPTO_LIBRARY
OPENSSL_CRYPTO_LIBRARY-ADVANCED:INTERNAL=1
//ADVANCED property for variable: OPENSSL_INCLUDE_DIR
OPENSSL_INCLUDE_DIR-ADVANCED:INTERNAL=1
//ADVANCED property for variable: OPENSSL_SSL_LIBRARY
OPENSSL_SSL_LIBRARY-ADVANCED:INTERNAL=1
//ADVANCED property for variable: PKG_CONFIG_EXECUTABLE
PKG_CONFIG_EXECUTABLE-ADVANCED:INTERNAL=1
//ADVANCED property for variable: PYTHON_INCLUDE_DIR
PYTHON_INCLUDE_DIR-ADVANCED:INTERNAL=1
//ADVANCED property for variable: PYTHON_LIBRARY
PYTHON_LIBRARY-ADVANCED:INTERNAL=1
//ADVANCED property for variable: PYTHON_LIBRARY_DEBUG
PYTHON_LIBRARY_DEBUG-ADVANCED:INTERNAL=1
//ADVANCED property for variable: ZLIB_INCLUDE_DIR
ZLIB_INCLUDE_DIR-ADVANCED:INTERNAL=1
//ADVANCED property for variable: ZLIB_LIBRARY_DEBUG
ZLIB_LIBRARY_DEBUG-ADVANCED:INTERNAL=1
//ADVANCED property for variable: ZLIB_LIBRARY_RELEASE
ZLIB_LIBRARY_RELEASE-ADVANCED:INTERNAL=1
//Components requested for this build tree.
_Boost_COMPONENTS_SEARCHED:INTERNAL=atomic;chrono;date_time;system;thread
//Last used Boost_INCLUDE_DIR value.
_Boost_INCLUDE_DIR_LAST:INTERNAL=/usr/include
//Last used Boost_LIBRARY_DIR_DEBUG value.
_Boost_LIBRARY_DIR_DEBUG_LAST:INTERNAL=/usr/lib/x86_64-linux-gnu
//Last used Boost_LIBRARY_DIR_RELEASE value.
_Boost_LIBRARY_DIR_RELEASE_LAST:INTERNAL=/usr/lib/x86_64-linux-gnu
//Last used Boost_NAMESPACE value.
_Boost_NAMESPACE_LAST:INTERNAL=boost
//Last used Boost_USE_MULTITHREADED value.
_Boost_USE_MULTITHREADED_LAST:INTERNAL=ON
//Last used Boost_USE_STATIC_LIBS value.
_Boost_USE_STATIC_LIBS_LAST:INTERNAL=ON
_OPENSSL_CFLAGS:INTERNAL=
_OPENSSL_CFLAGS_I:INTERNAL=
_OPENSSL_CFLAGS_OTHER:INTERNAL=
_OPENSSL_FOUND:INTERNAL=1
_OPENSSL_INCLUDEDIR:INTERNAL=/usr/include
_OPENSSL_INCLUDE_DIRS:INTERNAL=
_OPENSSL_LDFLAGS:INTERNAL=-lssl;-lcrypto
_OPENSSL_LDFLAGS_OTHER:INTERNAL=
_OPENSSL_LIBDIR:INTERNAL=/usr/lib/x86_64-linux-gnu
_OPENSSL_LIBRARIES:INTERNAL=ssl;crypto
_OPENSSL_LIBRARY_DIRS:INTERNAL=
_OPENSSL_LIBS:INTERNAL=
_OPENSSL_LIBS_L:INTERNAL=
_OPENSSL_LIBS_OTHER:INTERNAL=
_OPENSSL_LIBS_PATHS:INTERNAL=
_OPENSSL_PREFIX:INTERNAL=/usr
_OPENSSL_STATIC_CFLAGS:INTERNAL=
_OPENSSL_STATIC_CFLAGS_I:INTERNAL=
_OPENSSL_STATIC_CFLAGS_OTHER:INTERNAL=
_OPENSSL_STATIC_INCLUDE_DIRS:INTERNAL=
_OPENSSL_STATIC_LDFLAGS:INTERNAL=-lssl;-ldl;-lcrypto;-ldl
_OPENSSL_STATIC_LDFLAGS_OTHER:INTERNAL=
_OPENSSL_STATIC_LIBDIR:INTERNAL=
_OPENSSL_STATIC_LIBRARIES:INTERNAL=ssl;dl;crypto;dl
_OPENSSL_STATIC_LIBRARY_DIRS:INTERNAL=
_OPENSSL_STATIC_LIBS:INTERNAL=
_OPENSSL_STATIC_LIBS_L:INTERNAL=
_OPENSSL_STATIC_LIBS_OTHER:INTERNAL=
_OPENSSL_STATIC_LIBS_PATHS:INTERNAL=
_OPENSSL_VERSION:INTERNAL=1.1.0f
_OPENSSL_openssl_INCLUDEDIR:INTERNAL=
_OPENSSL_openssl_LIBDIR:INTERNAL=
_OPENSSL_openssl_PREFIX:INTERNAL=
_OPENSSL_openssl_VERSION:INTERNAL=
__pkg_config_arguments__OPENSSL:INTERNAL=QUIET;openssl
__pkg_config_checked__OPENSSL:INTERNAL=1
prefix_result:INTERNAL=/usr/lib/x86_64-linux-gnu

SweetPants
Posts: 2249
Joined: Friday 12 July 2013 21:24
Target OS: Linux
Domoticz version: V4.9999
Location: The Netherlands
Contact:

Re: [Debian Stretch] Compile error after 100%

Post by SweetPants » Wednesday 21 June 2017 14:54

Ubuntu 16.04.3 LTS, Intel NUC, MySensors 2.3.0-alpha, Pro Mini 3.3/8M RFM69(HW), ESP8266 (SDK2.2.0), Sonoff, RFLink, RFXcom, MQTT, NodeRed, Domoticz Beta (from source)

User avatar
gizmocuz
Posts: 8673
Joined: Thursday 11 July 2013 18:59
Target OS: Raspberry Pi
Domoticz version: beta
Location: Top of the world
Contact:

Re: [Debian Stretch] Compile error after 100%

Post by gizmocuz » Saturday 19 August 2017 16:18

and using the latest openzwave ? Do follow our wiki page how to compile for raspberry/ubuntu
Quality outlives Quantity!

pipiche
Posts: 51
Joined: Monday 02 April 2018 20:33
Target OS: Raspberry Pi
Domoticz version: beta
Location: France
Contact:

Re: [Debian Stretch] Compile error after 100%

Post by pipiche » Monday 11 June 2018 9:34

Having the same problem while using the Dev branch of Open-Zwave

domoticz - development branch
open-zwave dev branch

Environment is :
RPI3B+
Fedora 28 distribution

All build/link with the open-zwave release is working fine, only while trying to link with the open-zwave/dev branch is problematic

Post Reply

Who is online

Users browsing this forum: No registered users and 5 guests